{"text_format":"1","workbook":"xlsx","n_sheets":3,"sheets":["COUT","AIDE","IMPRIMCOUT"],"not_rendered":{"charts":1,"images":12,"macros":1,"external_links":0,"defined_names":11,"comments":0,"pivot_tables":0},"unopened":[],"bounds":{"document_bytes":16777216,"sheet_cells":100000,"rows_first":2000,"rows_last":500,"rows_between":2000,"halvings":0,"cell_chars":16384,"cell_head_chars":4096},"cells_cut":0,"cells_raw":0,"read":"whole","date_system":"1900"}

{"sheet":"COUT","index":0,"n_rows":97,"n_cols":36,"rows_kept":97,"cut":false,"hidden":false,"merged":[[0,1,1,24],[2,26,2,27],[6,26,6,27],[7,26,7,27],[5,24,7,24],[8,6,8,13],[8,5,9,5],[6,1,7,21],[4,15,5,22],[2,1,2,24],[9,1,9,2],[9,3,9,4],[8,1,8,4],[23,18,25,18],[8,26,8,27],[10,15,10,16],[8,15,9,16],[8,18,9,18],[8,20,9,20],[12,1,13,1],[12,4,13,4],[12,3,13,3],[10,5,11,5],[10,1,11,1],[10,4,11,4],[10,3,11,3],[24,3,25,3],[18,5,19,5],[18,4,19,4],[18,3,19,3],[18,1,19,1],[24,1,25,1],[24,4,25,4],[22,4,23,4],[22,1,23,1],[20,1,21,1],[20,3,21,3],[20,4,21,4],[20,5,21,5],[24,5,25,5],[22,5,23,5],[14,1,15,1],[14,3,15,3],[16,3,17,3],[22,3,23,3],[16,1,17,1],[16,4,17,4],[10,26,10,27],[14,4,15,4],[14,5,15,5],[16,5,17,5],[12,5,13,5],[11,18,13,18],[15,18,17,18]]}
[null,"  Formul'agno"]
[]
[null,"      Formulation et coût d'un aliment fermier agneau (v. 1.0) \nTous droits réservés  -  fabrice.ranoux@educagri.fr"]
[]
[null,null,null,null,null,null,null,null,null,null,null,null,null,null,null,"    Aliment démarrage           Aliment finition            Aliment unique",null,null,null,null,null,null,null,null,"COUT € / Tonne"]
[null,null,null,null,null,null,null,null,null,null,null,null,null,null,null,null,null,null,null,null,null,null,null,null,{"$f":"IF(B11=\"\",\"\",((U16*C15)+(U18*C17)+(U20*C19)+(U22*C21)+(U24*C23)+(U26*C25)+(U14*C13)+(U12*C11))/(B27))","v":""}]
[null,"Cliquez dans la case \"Matières premières\" et choisissez dans la liste - Saisissez ensuite les quantités introduites dans le mélange"]
[]
[null,"Utilisez les flèches faire varier les quantités",null,null,null,"%","Valeurs alimentaires",null,null,null,null,null,null,null,null,{"$f":"IF(B27=0,\"\",B27/100)","v":""},null,null,{"$f":"IF(P9=\"\",\"\",IF(OR(P9<1,P9>1),\"ATTENTION ! Votre total n'est pas égal à 100 %\",\"\"))","v":""},null,"Cliquez pour afficher le prix"]
[null,"Quantités",null,"Matières premières",null,null,"UFL","UFV","PDIN","PDIE","Pabs","Caabs","MAT","CB"]
[null,{"$f":"IF(C11=0,\"\",C11)","v":""},null,null,null,{"$f":"IF(B11=\"\",\"\",B11/$B$27)","v":""},{"$f":"IF($B11=\"\",\"\",VLOOKUP($E11,$E$38:$N$88,3))","v":""},{"$f":"IF($B11=\"\",\"\",VLOOKUP($E11,$E$38:$N$88,4))","v":""},{"$f":"IF($B11=\"\",\"\",VLOOKUP($E11,$E$38:$N$88,5))","v":""},{"$f":"IF($B11=\"\",\"\",VLOOKUP($E11,$E$38:$N$88,6))","v":""},{"$f":"IF($B11=\"\",\"\",VLOOKUP($E11,$E$38:$N$88,7))","v":""},{"$f":"IF($B11=\"\",\"\",VLOOKUP($E11,$E$38:$N$88,8))","v":""},{"$f":"IF($B11=\"\",\"\",VLOOKUP($E11,$E$38:$N$88,9))","v":""},{"$f":"IF($B11=\"\",\"\",VLOOKUP($E11,$E$38:$N$88,10))","v":""}]
[null,null,null,null,null,null,{"$f":"IF(B11=\"\",\"\",$F$11*G11)","v":""},{"$f":"IF(B11=\"\",\"\",$F$11*H11)","v":""},{"$f":"IF(B11=\"\",\"\",$F$11*I11)","v":""},{"$f":"IF(B11=\"\",\"\",$F$11*J11)","v":""},{"$f":"IF(B11=\"\",\"\",$F$11*K11)","v":""},{"$f":"IF(B11=\"\",\"\",$F$11*L11)","v":""},{"$f":"IF(B11=\"\",\"\",$F$11*M11)","v":""},{"$f":"IF(B11=\"\",\"\",$F$11*N11)","v":""},null,"UFL",{"$f":"IF(G12=\"\",\"\",SUM(G12,G14,G16,G18,G20,G22,G24,G26))","v":""},null,{"$f":"IF(Q12=\"\",\"\",IF(B37=2,S47,S48))","v":""},null,null,null,null,null,null,null,null,null,null,{"$f":"B11","v":""},{"$f":"AD12/AD12","v":{"$error":"#VALUE!"}},{"$f":"AD12/AD14","v":{"$error":"#VALUE!"}}]
[null,{"$f":"IF(C13=0,\"\",C13)","v":""},null,null,null,{"$f":"IF(B13=\"\",\"\",B13/$B$27)","v":""},{"$f":"IF($B13=\"\",\"\",VLOOKUP($E13,$E$38:$N$88,3))","v":""},{"$f":"IF($B13=\"\",\"\",VLOOKUP($E13,$E$38:$N$88,4))","v":""},{"$f":"IF($B13=\"\",\"\",VLOOKUP($E13,$E$38:$N$88,5))","v":""},{"$f":"IF($B13=\"\",\"\",VLOOKUP($E13,$E$38:$N$88,6))","v":""},{"$f":"IF($B13=\"\",\"\",VLOOKUP($E13,$E$38:$N$88,7))","v":""},{"$f":"IF($B13=\"\",\"\",VLOOKUP($E13,$E$38:$N$88,8))","v":""},{"$f":"IF($B13=\"\",\"\",VLOOKUP($E13,$E$38:$N$88,9))","v":""},{"$f":"IF($B13=\"\",\"\",VLOOKUP($E13,$E$38:$N$88,10))","v":""}]
[null,null,null,null,null,null,{"$f":"IF(B13=\"\",\"\",F13*G13)","v":""},{"$f":"IF(B13=\"\",\"\",F13*H13)","v":""},{"$f":"IF(B13=\"\",\"\",F13*I13)","v":""},{"$f":"IF(B13=\"\",\"\",F13*J13)","v":""},{"$f":"IF(B13=\"\",\"\",F13*K13)","v":""},{"$f":"IF(B13=\"\",\"\",F13*L13)","v":""},{"$f":"IF(B13=\"\",\"\",F13*M13)","v":""},{"$f":"IF(B13=\"\",\"\",$F$13*N13)","v":""},null,"UFV",{"$f":"IF(H12=\"\",\"\",SUM(H12,H14,H16,H18,H20,H22,H24,H26))","v":""},null,null,null,null,null,null,null,null,null,null,null,null,{"$f":"B13","v":""},{"$f":"AD14/AD12","v":{"$error":"#VALUE!"}},1]
[null,{"$f":"IF(C15=0,\"\",C15)","v":""},null,null,null,{"$f":"IF(B15=\"\",\"\",B15/$B$27)","v":""},{"$f":"IF($B15=\"\",\"\",VLOOKUP($E15,$E$38:$N$88,3))","v":""},{"$f":"IF($B15=\"\",\"\",VLOOKUP($E15,$E$38:$N$88,4))","v":""},{"$f":"IF($B15=\"\",\"\",VLOOKUP($E15,$E$38:$N$88,5))","v":""},{"$f":"IF($B15=\"\",\"\",VLOOKUP($E15,$E$38:$N$88,6))","v":""},{"$f":"IF($B15=\"\",\"\",VLOOKUP($E15,$E$38:$N$88,7))","v":""},{"$f":"IF($B15=\"\",\"\",VLOOKUP($E15,$E$38:$N$88,8))","v":""},{"$f":"IF($B15=\"\",\"\",VLOOKUP($E15,$E$38:$N$88,9))","v":""},{"$f":"IF($B15=\"\",\"\",VLOOKUP($E15,$E$38:$N$88,10))","v":""}]
[null,null,null,null,null,null,{"$f":"IF(B15=\"\",\"\",F15*G15)","v":""},{"$f":"IF(B15=\"\",\"\",F15*H15)","v":""},{"$f":"IF(B15=\"\",\"\",F15*I15)","v":""},{"$f":"IF(B15=\"\",\"\",F15*J15)","v":""},{"$f":"IF(B15=\"\",\"\",F15*K15)","v":""},{"$f":"IF(B15=\"\",\"\",F15*L15)","v":""},{"$f":"IF(B15=\"\",\"\",F15*M15)","v":""},{"$f":"IF(B15=\"\",\"\",$F$15*N15)","v":""},null,"PDIN",{"$f":"IF(I12=\"\",\"\",SUM(I12,I14,I16,I18,I20,I22,I24,I26))","v":""},null,{"$f":"IF(Q16=\"\",\"\",IF(B37=1,S42,IF(B37=2,S43,S44)))","v":""},null,null,null,null,null,null,null,null,null,null,{"$f":"B15","v":""},{"$f":"AD16/AD12","v":{"$error":"#VALUE!"}},{"$f":"AD16/AD14","v":{"$error":"#VALUE!"}}]
[null,{"$f":"IF(C17=0,\"\",C17)","v":""},null,null,null,{"$f":"IF(B17=\"\",\"\",B17/$B$27)","v":""},{"$f":"IF($B17=\"\",\"\",VLOOKUP($E17,$E$38:$N$88,3))","v":""},{"$f":"IF($B17=\"\",\"\",VLOOKUP($E17,$E$38:$N$88,4))","v":""},{"$f":"IF($B17=\"\",\"\",VLOOKUP($E17,$E$38:$N$88,5))","v":""},{"$f":"IF($B17=\"\",\"\",VLOOKUP($E17,$E$38:$N$88,6))","v":""},{"$f":"IF($B17=\"\",\"\",VLOOKUP($E17,$E$38:$N$88,7))","v":""},{"$f":"IF($B17=\"\",\"\",VLOOKUP($E17,$E$38:$N$88,8))","v":""},{"$f":"IF($B17=\"\",\"\",VLOOKUP($E17,$E$38:$N$88,9))","v":""},{"$f":"IF($B17=\"\",\"\",VLOOKUP($E17,$E$38:$N$88,10))","v":""}]
[null,null,null,null,null,null,{"$f":"IF(B17=\"\",\"\",F17*G17)","v":""},{"$f":"IF(B17=\"\",\"\",F17*H17)","v":""},{"$f":"IF(B17=\"\",\"\",F17*I17)","v":""},{"$f":"IF(B17=\"\",\"\",F17*J17)","v":""},{"$f":"IF(B17=\"\",\"\",F17*K17)","v":""},{"$f":"IF(B17=\"\",\"\",F17*L17)","v":""},{"$f":"IF(B17=\"\",\"\",F17*M17)","v":""},{"$f":"IF(B17=\"\",\"\",$F$17*N17)","v":""},null,"PDIE",{"$f":"IF(J12=\"\",\"\",SUM(J12,J14,J16,J18,J20,J22,J24,J26))","v":""},null,null,null,null,null,null,null,null,null,null,null,null,{"$f":"B17","v":""},{"$f":"AD18/AD12","v":{"$error":"#VALUE!"}},{"$f":"AD18/AD14","v":{"$error":"#VALUE!"}}]
[null,{"$f":"IF(C19=0,\"\",C19)","v":""},null,null,null,{"$f":"IF(B19=\"\",\"\",B19/$B$27)","v":""},{"$f":"IF($B19=\"\",\"\",VLOOKUP($E19,$E$38:$N$88,3))","v":""},{"$f":"IF($B19=\"\",\"\",VLOOKUP($E19,$E$38:$N$88,4))","v":""},{"$f":"IF($B19=\"\",\"\",VLOOKUP($E19,$E$38:$N$88,5))","v":""},{"$f":"IF($B19=\"\",\"\",VLOOKUP($E19,$E$38:$N$88,6))","v":""},{"$f":"IF($B19=\"\",\"\",VLOOKUP($E19,$E$38:$N$88,7))","v":""},{"$f":"IF($B19=\"\",\"\",VLOOKUP($E19,$E$38:$N$88,8))","v":""},{"$f":"IF($B19=\"\",\"\",VLOOKUP($E19,$E$38:$N$88,9))","v":""},{"$f":"IF($B19=\"\",\"\",VLOOKUP($E19,$E$38:$N$88,10))","v":""}]
[null,null,null,null,null,null,{"$f":"IF(B19=\"\",\"\",F19*G19)","v":""},{"$f":"IF(B19=\"\",\"\",F19*H19)","v":""},{"$f":"IF(B19=\"\",\"\",F19*I19)","v":""},{"$f":"IF(B19=\"\",\"\",F19*J19)","v":""},{"$f":"IF(B19=\"\",\"\",F19*K19)","v":""},{"$f":"IF(B19=\"\",\"\",F19*L19)","v":""},{"$f":"IF(B19=\"\",\"\",F19*M19)","v":""},{"$f":"IF(B19=\"\",\"\",$F$17*N19)","v":""},null,"P",{"$f":"IF(K12=\"\",\"\",SUM(K12,K14,K16,K18,K20,K22,K24,K26))","v":""},null,{"$f":"IF(Q20=\"\",\"\",IF(Q20<2,\"Augmentez le Phosphore\",IF(Q20>3,\"Le Phosphore est excédentaire\",\"Phosphore entre 2 et 3\")))","v":""},null,null,null,null,null,null,null,null,null,null,{"$f":"B19","v":""},{"$f":"AD20/AD12","v":{"$error":"#VALUE!"}},{"$f":"AD20/AD14","v":{"$error":"#VALUE!"}}]
[null,{"$f":"IF(C21=0,\"\",C21)","v":""},null,null,null,{"$f":"IF(B21=\"\",\"\",B21/$B$27)","v":""},{"$f":"IF($B21=\"\",\"\",VLOOKUP($E21,$E$38:$N$88,3))","v":""},{"$f":"IF($B21=\"\",\"\",VLOOKUP($E21,$E$38:$N$88,4))","v":""},{"$f":"IF($B21=\"\",\"\",VLOOKUP($E21,$E$38:$N$88,5))","v":""},{"$f":"IF($B21=\"\",\"\",VLOOKUP($E21,$E$38:$N$88,6))","v":""},{"$f":"IF($B21=\"\",\"\",VLOOKUP($E21,$E$38:$N$88,7))","v":""},{"$f":"IF($B21=\"\",\"\",VLOOKUP($E21,$E$38:$N$88,8))","v":""},{"$f":"IF($B21=\"\",\"\",VLOOKUP($E21,$E$38:$N$88,9))","v":""},{"$f":"IF($B21=\"\",\"\",VLOOKUP($E21,$E$38:$N$88,10))","v":""}]
[null,null,null,null,null,null,{"$f":"IF(B21=\"\",\"\",F21*G21)","v":""},{"$f":"IF(B21=\"\",\"\",F21*H21)","v":""},{"$f":"IF(B21=\"\",\"\",F21*I21)","v":""},{"$f":"IF(B21=\"\",\"\",F21*J21)","v":""},{"$f":"IF(B21=\"\",\"\",F21*K21)","v":""},{"$f":"IF(B21=\"\",\"\",F21*L21)","v":""},{"$f":"IF(B21=\"\",\"\",F21*M21)","v":""},{"$f":"IF(B21=\"\",\"\",$F$17*N21)","v":""},null,"Ca",{"$f":"IF(L12=\"\",\"\",SUM(L12,L14,L16,L18,L20,L22,L24,L26))","v":""},null,{"$f":"IF(Q22=\"\",\"\",IF(Q22<3,\"Augmentez le Calcium\",IF(Q22>5,\"Le Calcium est excédentaire\",\"Calcium entre 3 et 5\")))","v":""},null,null,null,null,null,null,null,null,null,null,{"$f":"B21","v":""},{"$f":"AD22/AD12","v":{"$error":"#VALUE!"}},{"$f":"AD22/AD14","v":{"$error":"#VALUE!"}}]
[null,{"$f":"IF(C23=0,\"\",C23)","v":""},null,null,null,{"$f":"IF(B23=\"\",\"\",B23/$B$27)","v":""},{"$f":"IF($B23=\"\",\"\",VLOOKUP($E23,$E$38:$N$88,3))","v":""},{"$f":"IF($B23=\"\",\"\",VLOOKUP($E23,$E$38:$N$88,4))","v":""},{"$f":"IF($B23=\"\",\"\",VLOOKUP($E23,$E$38:$N$88,5))","v":""},{"$f":"IF($B23=\"\",\"\",VLOOKUP($E23,$E$38:$N$88,6))","v":""},{"$f":"IF($B23=\"\",\"\",VLOOKUP($E23,$E$38:$N$88,7))","v":""},{"$f":"IF($B23=\"\",\"\",VLOOKUP($E23,$E$38:$N$88,8))","v":""},{"$f":"IF($B23=\"\",\"\",VLOOKUP($E23,$E$38:$N$88,9))","v":""},{"$f":"IF($B23=\"\",\"\",VLOOKUP($E23,$E$38:$N$88,10))","v":""}]
[null,null,null,null,null,null,{"$f":"IF(B23=\"\",\"\",F23*G23)","v":""},{"$f":"IF(B23=\"\",\"\",F23*H23)","v":""},{"$f":"IF(B23=\"\",\"\",F23*I23)","v":""},{"$f":"IF(B23=\"\",\"\",F23*J23)","v":""},{"$f":"IF(B23=\"\",\"\",F23*K23)","v":""},{"$f":"IF(B23=\"\",\"\",F23*L23)","v":""},{"$f":"IF(B23=\"\",\"\",F23*M23)","v":""},{"$f":"IF(B23=\"\",\"\",$F$23*N23)","v":""},null,"MAT",{"$f":"IF(M12=\"\",\"\",SUM(M12,M14,M16,M18,M20,M22,M24,M26))","v":""},null,{"$f":"IF(Q24=\"\",\"\",IF(B37=1,S37,IF(B37=2,S38,S39)))","v":""},null,null,null,null,null,null,null,null,null,null,{"$f":"B23","v":""},{"$f":"AD24/AD12","v":{"$error":"#VALUE!"}},{"$f":"AD24/AD14","v":{"$error":"#VALUE!"}}]
[null,{"$f":"IF(C25=0,\"\",C25)","v":""},null,null,null,{"$f":"IF(B25=\"\",\"\",B25/$B$27)","v":""},{"$f":"IF($B25=\"\",\"\",VLOOKUP($E25,$E$38:$N$88,3))","v":""},{"$f":"IF($B25=\"\",\"\",VLOOKUP($E25,$E$38:$N$88,4))","v":""},{"$f":"IF($B25=\"\",\"\",VLOOKUP($E25,$E$38:$N$88,5))","v":""},{"$f":"IF($B25=\"\",\"\",VLOOKUP($E25,$E$38:$N$88,6))","v":""},{"$f":"IF($B25=\"\",\"\",VLOOKUP($E25,$E$38:$N$88,7))","v":""},{"$f":"IF($B25=\"\",\"\",VLOOKUP($E25,$E$38:$N$88,8))","v":""},{"$f":"IF($B25=\"\",\"\",VLOOKUP($E25,$E$38:$N$88,9))","v":""},{"$f":"IF($B25=\"\",\"\",VLOOKUP($E25,$E$38:$N$88,10))","v":""}]
[null,null,null,null,null,null,{"$f":"IF(B25=\"\",\"\",F25*G25)","v":""},{"$f":"IF(B25=\"\",\"\",F25*H25)","v":""},{"$f":"IF(B25=\"\",\"\",F25*I25)","v":""},{"$f":"IF(B25=\"\",\"\",F25*J25)","v":""},{"$f":"IF(B25=\"\",\"\",F25*K25)","v":""},{"$f":"IF(B25=\"\",\"\",F25*L25)","v":""},{"$f":"IF(B25=\"\",\"\",F25*M25)","v":""},{"$f":"IF(B25=\"\",\"\",$F$25*N25)","v":""},null,"CB",{"$f":"IF(N12=\"\",\"\",SUM(N12,N14,N16,N18,N20,N22,N24,N26))","v":""},null,null,null,null,null,null,null,null,null,null,null,null,{"$f":"B25","v":""},{"$f":"AD26/AD12","v":{"$error":"#VALUE!"}},{"$f":"AD26/AD14","v":{"$error":"#VALUE!"}},null,null,null,1]
[null,{"$f":"SUM(B11:B26)","v":0}]
[]
[]
[]
[]
[]
[]
[]
[]
[null,null,null,null,null,null,null,null,null,null,null,null,null,null,null,null,null,null,null,null,null,null,null,null,null,null,null,1]
[null,3,null,null,"Catégorie","C","UFL","UFV","PDIN","PDIE","P","Ca","MAT","CB",null,null,null,null,{"$f":"IF(Q24>19,\"Les MAT sont excédentaires. Diminuez la valeur protéique.\",IF(Q24<17.5,\"Les MAT sont insuffisantes. Augmentez la valeur protéique.\",\"La valeur Azotée doit être comprise entre 17,5 % et 18,5 % de MAT.\"))","v":"Les MAT sont excédentaires. Diminuez la valeur protéique."},null,null,null,"Epeautre"]
[null,null,null,null,"ACL (aliment liquide)",null,0.52,0.5,75,75,0.1,0.2,18,2,null,null,null,null,{"$f":"IF(Q24>17,\"Les MAT sont excédentaires. Diminuez la valeur protéique.\",IF(Q24<15.5,\"Les MAT sont insuffisantes. Augmentez la valeur protéique.\",\"La valeur Azotée doit être comprise entre 15,5 % et 16,5 % de MAT.\"))","v":"Les MAT sont excédentaires. Diminuez la valeur protéique."},null,null,null,"Avoine"]
[null,null,null,null,"Aliment 15 % MAT",null,0.93,0.92,91,100,2.5,4.5,15,8.6999999999999993,null,null,null,null,{"$f":"IF(Q24>18,\"Les MAT sont excédentaires. Diminuez la valeur protéique.\",IF(Q24<16.5,\"Les MAT sont insuffisantes. Augmentez la valeur protéique.\",\"La valeur Azotée doit être comprise entre 16,5 % et 17,5 % de MAT.\"))","v":"Les MAT sont excédentaires. Diminuez la valeur protéique."},null,null,null,"Blé"]
[null,"Céréale",null,null,"Avoine",null,0.77,0.71,61,61,2.7,0.7,11.1,13.8,null,null,null,null,null,null,null,null,"Maïs grain"]
[null,"Tourteau",null,null,"Bicarbonate de Na",null,0,0,0,0,0,0,0,0,null,null,null,null,null,null,null,null,"Orge"]
[null,"Graines",null,null,"Blé",null,1.02,1.02,70,89,2.6,0.4,12.1,2.6,null,null,null,null,{"$f":"IF(Q16<110,\"Votre aliment manque de PDI. Vous devez apporter plus de protéines.\",IF(Q16>120,\"Les PDI sont excédentaires. Vous devez réduire les protéines.\",\"La valeur protéique doit être comprise entre 110 et 120 g de PDI\"))","v":"Les PDI sont excédentaires. Vous devez réduire les protéines."},null,null,null,"Sarrazin"]
[null,"Divers",null,null,"Carbonate de Ca",null,0,0,0,0,0,150,0,0,null,null,null,null,{"$f":"IF(Q16<90,\"Votre aliment manque de PDI. Vous devez apporter plus de protéines.\",IF(Q16>110,\"Les PDI sont excédentaires. Vous devez réduire les protéines.\",\"La valeur protéique doit être comprise entre 90 et 110 g de PDI\"))","v":"Les PDI sont excédentaires. Vous devez réduire les protéines."},null,null,null,"Seigle"]
[null,"Minéraux",null,null,"CMV 0 - 27",null,0,0,0,0,0,108,0,0,null,null,null,null,{"$f":"IF(Q16<100,\"Votre aliment manque de PDI. Vous devez apporter plus de protéines.\",IF(Q16>110,\"Les PDI sont excédentaires. Vous devez réduire les protéines.\",\"La valeur protéique doit être comprise entre 100 et 110 g de PDI\"))","v":"Les PDI sont excédentaires. Vous devez réduire les protéines."},null,null,null,"Sorgho"]
[null,"Commerce",null,null,"CMV 10 - 20",null,0,0,0,0,65,80,0,0,null,null,null,null,null,null,null,null,"Triticale"]
[null,null,null,null,"CMV 10 - 6",null,0,0,0,0,65,24,0,0]
[null,null,null,null,"CMV 12 - 12",null,0,0,0,0,78,48,0,0,null,null,null,null,{"$f":"IF(Q14<0.8,\"Votre aliment manque d'UF. Vous devez apporter un aliment plus énergétique.\",\"La valeur énergétique doit être comprise entre 0,80 et 1,00 UF\")","v":"La valeur énergétique doit être comprise entre 0,80 et 1,00 UF"},null,null,null,"Tourteau d'arachide"]
[null,null,null,null,"CMV 12 - 12",null,0,0,0,0,78,48,0,0,null,null,null,null,{"$f":"IF(Q14<0.9,\"Votre aliment manque d'UF. Vous devez apporter un aliment plus énergétique.\",\"La valeur énergétique doit être comprise entre 0,90 et 1,05 UF\")","v":"La valeur énergétique doit être comprise entre 0,90 et 1,05 UF"},null,null,null,"Tourteau de colza"]
[null,null,null,null,"CMV 2 - 28",null,0,0,0,0,13,112,0,0,null,null,null,null,null,null,null,null,"Tourteau de coton"]
[null,null,null,null,"CMV 3 - 27",null,0,0,0,0,20,108,0,0,null,null,null,null,null,null,null,null,"Tourteau de lin"]
[null,null,null,null,"CMV 4 - 21",null,0,0,0,0,26,84,0,0,null,null,null,null,null,null,null,null,"Tourteau de soja "]
[null,null,null,null,"CMV 5 - 20",null,0,0,0,0,32,80,0,0,null,null,null,null,null,null,null,null,"Tourteau de tournesol"]
[null,null,null,null,"CMV 5 - 25",null,0,0,0,0,32,100,0,0]
[null,null,null,null,"CMV 6 - 6",null,0,0,0,0,39,24,0,0,null,null,null,null,null,null,null,null,"Féverole"]
[null,null,null,null,"CMV 7 - 21",null,0,0,0,0,15,84,0,0,null,null,null,null,null,null,null,null,"Graines de colza"]
[null,null,null,null,"CMV 8 - 12 ",null,0,0,0,0,52,48,0,0,null,null,null,null,null,null,null,null,"Graines de coton"]
[null,null,null,null,"CMV 8 - 16 ",null,0,0,0,0,52,64,0,0,null,null,null,null,null,null,null,null,"Graines de lin"]
[null,null,null,null,"CMV 8 - 24",null,0,0,0,0,52,96,0,0,null,null,null,null,null,null,null,null,"Graines de soja"]
[null,null,null,null,"CMV 9 - 14",null,0,0,0,0,58,56,0,0,null,null,null,null,null,null,null,null,"Graines de tournesol"]
[null,null,null,null,"Complémentaire céréales",null,0.82,0.78,190,145,4.5,12,31,10.199999999999999,null,null,null,null,null,null,null,null,"Lupin"]
[null,null,null,null,"Complet démarrage",null,0.93,0.92,115,110,2.7,4.8,18,8.5,null,null,null,null,null,null,null,null,"Pois"]
[null,null,null,null,"Complet finition",null,0.93,0.92,100,105,2.5,4.5,16.5,9.8000000000000007,null,null,null,null,null,null,null,null,"Vesce"]
[null,null,null,null,"Drêches de blé",null,0.76,0.68,178,157,4.9000000000000004,1.3,31,6]
[null,null,null,null,"Drêches de brasserie",null,0.75,0.67,180,160,5,1,31.6,6.1]
[null,null,null,null,"Epeautre",null,0.85,0.82,66,82,3,0.5,10.4,12.7,null,null,null,null,null,null,null,null,"Bicarbonate de Na"]
[null,null,null,null,"Féverole",null,1.03,1.03,170,97,4.0999999999999996,0.9,31.1,9.6,null,null,null,null,null,null,null,null,"Drêches de blé"]
[null,null,null,null,"Graines de colza",null,1.68,1.68,12,61,5.3,2.8,20.7,8.9,null,null,null,null,null,null,null,null,"Drêches de brasserie"]
[null,null,null,null,"Graines de coton",null,0.94,0.85,131,77,5.0999999999999996,1,23.4,25.9,null,null,null,null,null,null,null,null,"Huile de colza"]
[null,null,null,null,"Huile de colza",null,2.73,2.78,0,0,0,0,0,0,null,null,null,null,null,null,null,null,"ACL (aliment liquide)"]
[null,null,null,null,"Lupin",null,1.18,1.18,213,106,3.2,2.1,38.5,12.8,null,null,null,null,null,null,null,null,"Luzerne deshydratée"]
[null,null,null,null,"Luzerne déshydratée",null,0.62,0.54,103,91,1.9,6.5,17.5,29.5,null,null,null,null,null,null,null,null,"Mélasse"]
[null,null,null,null,"Maïs grain",null,1.06,1.06,64,84,2.2000000000000002,0.3,9.4,2.5,null,null,null,null,null,null,null,null,"Poudre de lait écrémé"]
[null,null,null,null,"Mélange tourteaux",null,0.92,0.9,250,180,6.5,3.5,40,11,null,null,null,null,null,null,null,null,"Pulpe de betterave"]
[null,null,null,null,"Mélasse",null,0.75,0.75,63,54,0.2,0.5,14.5,0,null,null,0]
[null,null,null,null,"Orge",null,0.95,0.93,69,87,3,0.5,11.6,5.2,null,null,100,null,null,null,null,null,"Carbonate de Ca"]
[null,null,null,null,"Pois",null,1.04,1.05,130,83,3.4,0.7,23.9,6,null,null,100,null,null,null,null,null,"CMV 0 - 27"]
[null,null,null,null,"Poudre de lait écrémé",null,1.1499999999999999,1.17,196,75,9.6999999999999993,11.7,36,0,null,null,120,null,null,null,null,null,"CMV 10 - 20"]
[null,null,null,null,"Pulpe de betterave",null,0.89,0.87,59,97,0.9,3,9.1,19.399999999999999,null,null,120,null,null,null,null,null,"CMV 10 - 6"]
[null,null,null,null,"Sarrazin",null,0.81,0.76,77,82,2.6,0.5,13.1,11.6,null,null,40,null,null,null,null,null,"CMV 12 - 12"]
[null,null,null,null,"Seigle",null,1.03,1.03,59,85,2.6,0.7,10.3,2.2000000000000002,null,null,50,null,null,null,null,null,"CMV 2 - 28"]
[null,null,null,null,"Sorgho",null,1.05,1.06,67,87,2.4,0.2,10.9,2.7,null,null,50,null,null,null,null,null,"CMV 3 - 27"]
[null,null,null,null,"Tourteau d'arachide",null,1,0.97,347,215,4.0999999999999996,1.2,54.6,7.6,null,null,60,null,null,null,null,null,"CMV 4 - 21"]
[null,null,null,null,"Tourteau de colza",null,0.85,0.8,219,138,9.1999999999999993,5.2,35,13.9,null,null,70,null,null,null,null,null,"CMV 5 - 20"]
[null,null,null,null,"Tourteau de lin",null,0.88,0.84,227,179,6,2.8,35.9,11,null,null,80,null,null,null,null,null,"CMV 5 - 25"]
[null,null,null,null,"Tourteau de soja",null,1.06,1.05,331,229,5,2.1,51.6,6.8,null,null,80,null,null,null,null,null,"CMV 6 - 6"]
[null,null,null,null,"Tourteau de tournesol",null,0.56000000000000005,0.46,178,93,7.4,2.4,37.299999999999997,23.6,null,null,80,null,null,null,null,null,"CMV 7 - 21"]
[null,null,null,null,"Triticale",null,1.01,1.02,63,84,3,0.5,11,2.7,null,null,90,null,null,null,null,null,"CMV 8 - 12 "]
[null,null,null,null,"Urée",null,0,0,1443,0,0,0,0,0,null,null,0,null,null,null,null,null,"CMV 8 - 16 "]
[null,null,null,null,"Vesce",null,1.02,1.01,161,90,3.8,1,29.6,7.4,null,null,null,null,null,null,null,null,"CMV 8 - 24"]
[null,null,null,null,null,null,null,null,null,null,null,null,null,null,null,null,null,null,null,null,null,null,"CMV 9 - 14"]
[]
[null,null,null,null,null,null,null,null,null,null,null,null,null,null,null,null,null,null,null,null,null,null,"Complet démarrage"]
[null,null,null,null,null,null,null,null,null,null,null,null,null,null,null,null,null,null,null,null,null,null,"Complémentaire céréales"]
[null,null,null,null,null,null,null,null,null,null,null,null,null,null,null,null,null,null,null,null,null,null,"Mélange tourteaux"]
[null,null,null,null,null,null,null,null,null,null,null,null,null,null,null,null,null,null,null,null,null,null,"Complet finition"]
[null,null,null,null,null,null,null,null,null,null,null,null,null,null,null,null,null,null,null,null,null,null,"ACL (aliment liquide)"]
[null,null,null,null,null,null,null,null,null,null,null,null,null,null,null,null,null,null,null,null,null,null,"Aliment 15 % MAT"]

{"sheet":"AIDE","index":1,"n_rows":17,"n_cols":17,"rows_kept":17,"cut":false,"hidden":false,"merged":[[0,1,2,18],[12,16,12,18],[14,16,14,18],[16,16,16,18]]}
[null,"Formulation et coût d'un aliment agneau (v. 1.0) "]
[]
[]
[]
[]
[]
[]
[]
[]
[]
[]
[]
[null,null,null,null,null,null,null,null,null,null,null,null,null,null,null,null,"Valeurs conformes"]
[]
[null,null,null,null,null,null,null,null,null,null,null,null,null,null,null,null,"Valeurs limites mais acceptables"]
[]
[null,null,null,null,null,null,null,null,null,null,null,null,null,null,null,null,"Valeurs excessives ou insuffisantes"]

{"sheet":"IMPRIMCOUT","index":2,"n_rows":80,"n_cols":21,"rows_kept":80,"cut":false,"hidden":false,"merged":[[4,14,5,15],[24,14,24,15],[14,1,15,1],[14,2,15,2],[14,3,15,3],[10,2,11,2],[10,3,11,3],[4,2,5,2],[8,1,9,1],[8,2,9,2],[8,3,9,3],[10,1,11,1],[12,1,13,1],[12,2,13,2],[12,3,13,3],[16,1,17,1],[2,9,2,12],[16,2,17,2],[16,3,17,3],[20,1,21,1],[20,2,21,2],[20,3,21,3],[18,1,19,1],[18,2,19,2],[18,3,19,3],[4,1,5,1],[6,1,7,1],[6,2,7,2],[6,3,7,3],[4,3,4,10],[22,4,23,4],[22,5,23,6],[22,8,23,8],[22,9,23,9],[22,2,23,3]]}
[]
[]
[null,"Formul' agno (v. 1.0) ",null,null,null,null,null,null,null,{"$f":"IF(COUT!B37=1,\"Aliment démarrage\",IF(COUT!B37=2,\"Aliment finition\",\"Aliment unique\"))","v":"Aliment unique"}]
[null,null,null,null,null,null,null,null,null,null,null,{"$f":"COUT!Q8","v":0}]
[null,{"$f":"COUT!#REF!","v":{"$error":"#REF!"}},{"$f":"COUT!B9","v":"Utilisez les flèches faire varier les quantités"},{"$f":"COUT!G9","v":"Valeurs alimentaires"}]
[null,null,null,{"$f":"COUT!F9","v":"%"},{"$f":"COUT!H10","v":"UFV"},{"$f":"COUT!I10","v":"PDIN"},{"$f":"COUT!J10","v":"PDIE"},{"$f":"COUT!K10","v":"Pabs"},{"$f":"COUT!L10","v":"Caabs"},"MAT","CB"]
[null,{"$f":"IF(COUT!B11=\"\",\"\",COUT!B11)","v":""},{"$f":"IF(COUT!E11=\"\",\"\",COUT!E11)","v":""},{"$f":"COUT!F11","v":""},{"$f":"COUT!G11","v":""},{"$f":"COUT!I11","v":""},{"$f":"COUT!J11","v":""},{"$f":"COUT!K11","v":""},{"$f":"COUT!L11","v":""},{"$f":"COUT!M11","v":""},{"$f":"COUT!N11","v":""}]
[null,null,null,null,{"$f":"COUT!G12","v":""},{"$f":"COUT!I12","v":""},{"$f":"COUT!J12","v":""},{"$f":"COUT!K12","v":""},{"$f":"COUT!L12","v":""},{"$f":"COUT!M12","v":""},{"$f":"COUT!N12","v":""},null,{"$f":"COUT!U12","v":0}]
[null,{"$f":"IF(COUT!B13=\"\",\"\",COUT!B13)","v":""},{"$f":"IF(COUT!E13=\"\",\"\",COUT!E13)","v":""},{"$f":"COUT!F13","v":""},{"$f":"COUT!G13","v":""},{"$f":"COUT!I13","v":""},{"$f":"COUT!J13","v":""},{"$f":"COUT!K13","v":""},{"$f":"COUT!L13","v":""},{"$f":"COUT!M13","v":""},{"$f":"COUT!N13","v":""}]
[null,null,null,null,{"$f":"COUT!G14","v":""},{"$f":"COUT!I14","v":""},{"$f":"COUT!J14","v":""},{"$f":"COUT!K14","v":""},{"$f":"COUT!L14","v":""},{"$f":"COUT!M14","v":""},{"$f":"COUT!N14","v":""},null,{"$f":"COUT!U14","v":0}]
[null,{"$f":"IF(COUT!B15=\"\",\"\",COUT!B15)","v":""},{"$f":"IF(COUT!E15=\"\",\"\",COUT!E15)","v":""},{"$f":"COUT!F15","v":""},{"$f":"COUT!G15","v":""},{"$f":"COUT!I15","v":""},{"$f":"COUT!J15","v":""},{"$f":"COUT!K15","v":""},{"$f":"COUT!L15","v":""},{"$f":"COUT!M15","v":""},{"$f":"COUT!N15","v":""}]
[null,null,null,null,{"$f":"COUT!G16","v":""},{"$f":"COUT!I16","v":""},{"$f":"COUT!J16","v":""},{"$f":"COUT!K16","v":""},{"$f":"COUT!L16","v":""},{"$f":"COUT!M16","v":""},{"$f":"COUT!N16","v":""},null,{"$f":"COUT!U16","v":0}]
[null,{"$f":"IF(COUT!B17=\"\",\"\",COUT!B17)","v":""},{"$f":"IF(COUT!E17=\"\",\"\",COUT!E17)","v":""},{"$f":"COUT!F17","v":""},{"$f":"COUT!G17","v":""},{"$f":"COUT!I17","v":""},{"$f":"COUT!J17","v":""},{"$f":"COUT!K17","v":""},{"$f":"COUT!L17","v":""},{"$f":"COUT!M17","v":""},{"$f":"COUT!N17","v":""}]
[null,null,null,null,{"$f":"COUT!G18","v":""},{"$f":"COUT!I18","v":""},{"$f":"COUT!J18","v":""},{"$f":"COUT!K18","v":""},{"$f":"COUT!L18","v":""},{"$f":"COUT!M18","v":""},{"$f":"COUT!N18","v":""},null,{"$f":"COUT!U18","v":0}]
[null,{"$f":"IF(COUT!B19=\"\",\"\",COUT!B19)","v":""},{"$f":"IF(COUT!E19=\"\",\"\",COUT!E19)","v":""},{"$f":"COUT!F19","v":""},{"$f":"COUT!G19","v":""},{"$f":"COUT!I19","v":""},{"$f":"COUT!J19","v":""},{"$f":"COUT!K19","v":""},{"$f":"COUT!L19","v":""},{"$f":"COUT!M19","v":""},{"$f":"COUT!N19","v":""}]
[null,null,null,null,{"$f":"COUT!G20","v":""},{"$f":"COUT!I20","v":""},{"$f":"COUT!J20","v":""},{"$f":"COUT!K20","v":""},{"$f":"COUT!L20","v":""},{"$f":"COUT!M20","v":""},{"$f":"COUT!N20","v":""},null,{"$f":"COUT!U20","v":0}]
[null,{"$f":"IF(COUT!B21=\"\",\"\",COUT!B21)","v":""},{"$f":"IF(COUT!E21=\"\",\"\",COUT!E21)","v":""},{"$f":"COUT!F21","v":""},{"$f":"COUT!G21","v":""},{"$f":"COUT!I21","v":""},{"$f":"COUT!J21","v":""},{"$f":"COUT!K21","v":""},{"$f":"COUT!L21","v":""},{"$f":"COUT!M21","v":""},{"$f":"COUT!N21","v":""}]
[null,null,null,null,{"$f":"COUT!G22","v":""},{"$f":"COUT!I22","v":""},{"$f":"COUT!J22","v":""},{"$f":"COUT!K22","v":""},{"$f":"COUT!L22","v":""},{"$f":"COUT!M22","v":""},{"$f":"COUT!N22","v":""},null,{"$f":"COUT!U22","v":0}]
[null,{"$f":"IF(COUT!B23=\"\",\"\",COUT!B23)","v":""},{"$f":"IF(COUT!E23=\"\",\"\",COUT!E23)","v":""},{"$f":"COUT!F23","v":""},{"$f":"COUT!G23","v":""},{"$f":"COUT!I23","v":""},{"$f":"COUT!J23","v":""},{"$f":"COUT!K23","v":""},{"$f":"COUT!L23","v":""},{"$f":"COUT!M23","v":""},{"$f":"COUT!N23","v":""}]
[null,null,null,null,{"$f":"COUT!G24","v":""},{"$f":"COUT!I24","v":""},{"$f":"COUT!J24","v":""},{"$f":"COUT!K24","v":""},{"$f":"COUT!L24","v":""},{"$f":"COUT!M24","v":""},{"$f":"COUT!N24","v":""},null,{"$f":"COUT!U24","v":0}]
[null,{"$f":"IF(COUT!B25=\"\",\"\",COUT!B25)","v":""},{"$f":"IF(COUT!E25=\"\",\"\",COUT!E25)","v":""},{"$f":"COUT!F25","v":""},{"$f":"COUT!G25","v":""},{"$f":"COUT!I25","v":""},{"$f":"COUT!J25","v":""},{"$f":"COUT!K25","v":""},{"$f":"COUT!L25","v":""},{"$f":"COUT!M25","v":""},{"$f":"COUT!N25","v":""}]
[null,null,null,null,{"$f":"COUT!G26","v":""},{"$f":"COUT!I26","v":""},{"$f":"COUT!J26","v":""},{"$f":"COUT!K26","v":""},{"$f":"COUT!L26","v":""},{"$f":"COUT!M26","v":""},{"$f":"COUT!N26","v":""},null,{"$f":"COUT!U26","v":0}]
[]
[null,null,null,null,null,null,null,null,null,null,null,null,{"$f":"COUT!Y5","v":"COUT € / Tonne"}]
[null,{"$f":"COUT!B27","v":0},{"$f":"COUT!E29","v":0},{"$f":"SUM(D7:D22)","v":0},{"$f":"COUT!Q14","v":""},{"$f":"COUT!Q16","v":""},{"$f":"COUT!Q18","v":""},{"$f":"COUT!Q20","v":""},{"$f":"COUT!Q22","v":""},{"$f":"COUT!Q24","v":""},{"$f":"COUT!Q26","v":""},null,{"$f":"COUT!Y6","v":""}]
[]
[]
[]
[]
[null,null,"Catégorie","C","U.F.L.","P.D.I.N.","P.D.I.E.","Pabs","Caabs",null,null,null,null,null,null,null,null,null,null,null,1]
[null,null,"Aliment complet",null,{"$f":"#REF!","v":{"$error":"#REF!"}},{"$f":"#REF!","v":{"$error":"#REF!"}},{"$f":"#REF!","v":{"$error":"#REF!"}},{"$f":"#REF!","v":{"$error":"#REF!"}},{"$f":"#REF!","v":{"$error":"#REF!"}}]
[null,null,"Aliment divers",null,{"$f":"#REF!","v":{"$error":"#REF!"}},{"$f":"#REF!","v":{"$error":"#REF!"}},{"$f":"#REF!","v":{"$error":"#REF!"}},{"$f":"#REF!","v":{"$error":"#REF!"}},{"$f":"#REF!","v":{"$error":"#REF!"}}]
[null,null,"Avoine",null,0.77,61,61,2.7,0.7]
[null,null,"Bicarbonate de Na",null,0,0,0,0,0]
[null,null,"Blé",null,1.02,70,89,2.6,0.4]
[null,null,"Carbonate de Ca",null,0,0,0,0,150]
[null,null,"CMV 0 - 27 (Gravelle)",null,0,0,0,0,108]
[null,null,"CMV 10 - 20",null,0,0,0,65,80]
[null,null,"CMV 10 - 6",null,0,0,0,65,24]
[null,null,"CMV 12 - 12",null,0,0,0,78,48]
[null,null,"CMV 12 - 12",null,0,0,0,78,48]
[null,null,"CMV 4 - 21",null,0,0,0,26,84]
[null,null,"CMV 5 - 20",null,0,0,0,32,80]
[null,null,"CMV 5 - 25",null,0,0,0,32,100]
[null,null,"CMV 6 - 6",null,0,0,0,39,24]
[null,null,"CMV 7 - 21",null,0,0,0,15,84]
[null,null,"CMV 8 - 12 ",null,0,0,0,52,48]
[null,null,"CMV 8 - 16 ",null,0,0,0,52,64]
[null,null,"CMV 8 - 24",null,0,0,0,52,96]
[null,null,"CMV 9 - 14",null,0,0,0,58,56]
[null,null,"Complémentaire azoté",null,{"$f":"#REF!","v":{"$error":"#REF!"}},{"$f":"#REF!","v":{"$error":"#REF!"}},{"$f":"#REF!","v":{"$error":"#REF!"}},{"$f":"#REF!","v":{"$error":"#REF!"}},{"$f":"#REF!","v":{"$error":"#REF!"}}]
[null,null,"Drêches",null,0.76,178,157,4.9000000000000004,1.3]
[null,null,"Féverole",null,1.03,170,97,4.0999999999999996,0.9]
[null,null,"Graines Colza",null,1.68,12,61,5.3,2.8]
[null,null,"Graines Coton",null,0.94,131,77,5.0999999999999996,1]
[null,null,"Huile de colza",null,2.73,0,0,0,0]
[null,null,"Lupin Blanc",null,1.18,213,106,3.2,2.1]
[null,null,"Luzerne déhydratée",null,0.62,103,91,1.9,6.5]
[null,null,"Maïs grain",null,1.06,64,84,2.2000000000000002,0.3]
[null,null,"Mélange 2/3   O - 1/3 S",null,0.98666666568000005,156.33333317699999,134.33333319900001,3.666666663,1.0333333323]
[null,null,"Mélange 2/3   T - 1/3 C",null,0.95666666571000003,114.99999988500001,101.999999898,5.0666666616000002,2.0666666646]
[null,null,"Mélange 3/4   O - 1/4 S",null,0.97749999999999992,134.5,122.5,3.5,0.9]
[null,null,"Mélange 80 %   O - 20 % S",null,0.97199999999999998,121.4,115.4,3.4000000000000004,0.82000000000000006]
[null,null,"Mélasse",null,0.75,63,54,0.2,0.5]
[null,null,"Mon concentré",null,{"$f":"COUT!#REF!","v":{"$error":"#REF!"}},{"$f":"COUT!I9","v":0},{"$f":"COUT!J9","v":0},{"$f":"COUT!K9","v":0},{"$f":"COUT!L9","v":0}]
[null,null,"Orge",null,0.95,69,87,3,0.5,null,null,0]
[null,null,"Pois",null,1.04,130,83,3.4,0.7,null,null,100]
[null,null,"Poudre de lait écrémé",null,1.1499999999999999,196,75,9.6999999999999993,11.7,null,null,100]
[null,null,"Pulpe de betterave",null,0.89,59,97,0.9,3,null,null,120]
[null,null,"Sarrazin",null,0.81,77,82,2.6,0.5,null,null,120]
[null,null,"Seigle",null,1.03,59,85,2.6,0.7,null,null,40]
[null,null,"Sorgho",null,1.05,67,87,2.4,0.2,null,null,50]
[null,null,"Tourteau Arachide",null,1,347,215,4.0999999999999996,1.2,null,null,50]
[null,null,"Tourteau Colza 35",null,0.85,219,138,9.1999999999999993,5.2,null,null,60]
[null,null,"Tourteau Lin",null,0.88,227,179,6,2.8,null,null,70]
[null,null,"Tourteau Soja 48",null,1.06,331,229,5,2.1,null,null,80]
[null,null,"Tourteau Tournesol",null,0.56000000000000005,178,93,7.4,2.4,null,null,80]
[null,null,"Triticale",null,1.01,63,84,3,0.5,null,null,80]
[null,null,"Urée",null,0,1443,0,0,0,null,null,90]
[null,null,"Vesce",null,1.02,161,90,3.8,1,null,null,0]